{"text_format":"1","workbook":"xlsx","n_sheets":2,"sheets":["ADMIN","ProjectPermissions"],"not_rendered":{"charts":0,"images":0,"macros":1,"external_links":0,"defined_names":0,"comments":0,"pivot_tables":0},"unopened":[],"bounds":{"document_bytes":16777216,"sheet_cells":100000,"rows_first":2000,"rows_last":500,"rows_between":2000,"halvings":0,"cell_chars":16384,"cell_head_chars":4096},"cells_cut":0,"cells_raw":0,"read":"whole","date_system":"1900"}

{"sheet":"ADMIN","index":0,"n_rows":22,"n_cols":6,"rows_kept":22,"cut":false,"hidden":true,"merged":[]}
["Company Name","Company Abbreviation","Access Groups","Access Group Name","Access Group Description","Actions"]
["DelDOT","DelDOT","Bridge (DOT)","Bridge","Bridge designers and managers","Add User"]
["AECOM","AEC","Road (DOT)","Road","Road designers and managers","Remove User"]
["Century Engineering","CEI","PM (Consultant)","PM","Project managers","Modify User"]
["Dovetail Civil Design, Inc.","DCD","Design (Consultants)","Design","Designers","Change Permissions"]
["Floura Teeter Landscape Architects","FTL","Bridge (Consultants)","Bridge","Bridge Designers","No Change"]
["Greenman-Pedersen, Inc.","GPI","Road (Consultants)","Road","Road Designers"]
["Haley Aldrich","HA","Survey (Consultants)","Survey","Surveyors"]
["Jacobs Engineering","JE","SW (Consultants)","SW","Stormwater Designers"]
["Johnson, Mirmiran and Thompson, Inc.","JMT","Traffic (Consultants)","Traffic","Traffic Designers"]
["Kleinfelder","KLF"]
["McCormick Taylor","MT"]
["Navarro and Wright","NW"]
["Pennoni","PEN"]
["Rybinski Engineering","RE"]
["Rummel, Klepper, and Kahl","RKK"]
["Rossi Engineering","ROS"]
["Schnabel Engineering","SE"]
["TORREngineering","TOR"]
["T.Y. Lin","TYL"]
["Wallace Montgomery","WM"]
["Whitman, Requardt and Associates","WRA"]

{"sheet":"ProjectPermissions","index":1,"n_rows":301,"n_cols":12,"rows_kept":301,"cut":false,"hidden":false,"merged":[]}
["Action","Project Number","Company Name","Access Group","User Email","User Name","UserList","UserList Description","Company Abbreviation","Access Group Name","User Check (VBA)","UserList Check (VBA)"]
["Add User","T123456789","DelDOT","Road (DOT)","David.Kleinot@Delaware.gov","David Kleinot",{"$f":"IF(ISBLANK(A2),\"\",B2&\"_\"&I2&\"_\"&J2)","v":"T123456789_DelDOT_Road"},{"$f":"IF(ISBLANK(A2),\"\",B2&\"_\"&I2&\" \"&VLOOKUP(D2,ADMIN!$C$2:$E$10,3,FALSE))","v":"T123456789_DelDOT Road designers and managers"},{"$f":"IF(ISBLANK(A2),\"\",VLOOKUP(C2,ADMIN!$A$2:$B$22,2,FALSE))","v":"DelDOT"},{"$f":"IF(ISBLANK(A2),\"\",VLOOKUP(D2,ADMIN!$C$2:$D$10,2,FALSE))","v":"Road"}]
[null,null,null,null,null,null,{"$f":"IF(ISBLANK(A3),\"\",B3&\"_\"&I3&\"_\"&J3)","v":""},{"$f":"IF(ISBLANK(A3),\"\",B3&\"_\"&I3&\" \"&VLOOKUP(D3,ADMIN!$C$2:$E$10,3,FALSE))","v":""},{"$f":"IF(ISBLANK(A3),\"\",VLOOKUP(C3,ADMIN!$A$2:$B$22,2,FALSE))","v":""},{"$f":"IF(ISBLANK(A3),\"\",VLOOKUP(D3,ADMIN!$C$2:$D$10,2,FALSE))","v":""}]
[null,null,null,null,null,null,"",{"$f":"IF(ISBLANK(A4),\"\",B4&\"_\"&I4&\" \"&VLOOKUP(D4,ADMIN!$C$2:$E$10,3,FALSE))","v":""},{"$f":"IF(ISBLANK(A4),\"\",VLOOKUP(C4,ADMIN!$A$2:$B$22,2,FALSE))","v":""},{"$f":"IF(ISBLANK(A4),\"\",VLOOKUP(D4,ADMIN!$C$2:$D$10,2,FALSE))","v":""}]
[null,null,null,null,null,null,"",{"$f":"IF(ISBLANK(A5),\"\",B5&\"_\"&I5&\" \"&VLOOKUP(D5,ADMIN!$C$2:$E$10,3,FALSE))","v":""},{"$f":"IF(ISBLANK(A5),\"\",VLOOKUP(C5,ADMIN!$A$2:$B$22,2,FALSE))","v":""},{"$f":"IF(ISBLANK(A5),\"\",VLOOKUP(D5,ADMIN!$C$2:$D$10,2,FALSE))","v":""}]
[null,null,null,null,null,null,"",{"$f":"IF(ISBLANK(A6),\"\",B6&\"_\"&I6&\" \"&VLOOKUP(D6,ADMIN!$C$2:$E$10,3,FALSE))","v":""},{"$f":"IF(ISBLANK(A6),\"\",VLOOKUP(C6,ADMIN!$A$2:$B$22,2,FALSE))","v":""},{"$f":"IF(ISBLANK(A6),\"\",VLOOKUP(D6,ADMIN!$C$2:$D$10,2,FALSE))","v":""}]
[null,null,null,null,null,null,"",{"$f":"IF(ISBLANK(A7),\"\",B7&\"_\"&I7&\" \"&VLOOKUP(D7,ADMIN!$C$2:$E$10,3,FALSE))","v":""},{"$f":"IF(ISBLANK(A7),\"\",VLOOKUP(C7,ADMIN!$A$2:$B$22,2,FALSE))","v":""},{"$f":"IF(ISBLANK(A7),\"\",VLOOKUP(D7,ADMIN!$C$2:$D$10,2,FALSE))","v":""}]
[null,null,null,null,null,null,"",{"$f":"IF(ISBLANK(A8),\"\",B8&\"_\"&I8&\" \"&VLOOKUP(D8,ADMIN!$C$2:$E$10,3,FALSE))","v":""},{"$f":"IF(ISBLANK(A8),\"\",VLOOKUP(C8,ADMIN!$A$2:$B$22,2,FALSE))","v":""},{"$f":"IF(ISBLANK(A8),\"\",VLOOKUP(D8,ADMIN!$C$2:$D$10,2,FALSE))","v":""}]
[null,null,null,null,null,null,"",{"$f":"IF(ISBLANK(A9),\"\",B9&\"_\"&I9&\" \"&VLOOKUP(D9,ADMIN!$C$2:$E$10,3,FALSE))","v":""},{"$f":"IF(ISBLANK(A9),\"\",VLOOKUP(C9,ADMIN!$A$2:$B$22,2,FALSE))","v":""},{"$f":"IF(ISBLANK(A9),\"\",VLOOKUP(D9,ADMIN!$C$2:$D$10,2,FALSE))","v":""}]
[null,null,null,null,null,null,"",{"$f":"IF(ISBLANK(A10),\"\",B10&\"_\"&I10&\" \"&VLOOKUP(D10,ADMIN!$C$2:$E$10,3,FALSE))","v":""},{"$f":"IF(ISBLANK(A10),\"\",VLOOKUP(C10,ADMIN!$A$2:$B$22,2,FALSE))","v":""},{"$f":"IF(ISBLANK(A10),\"\",VLOOKUP(D10,ADMIN!$C$2:$D$10,2,FALSE))","v":""}]
[null,null,null,null,null,null,"",{"$f":"IF(ISBLANK(A11),\"\",B11&\"_\"&I11&\" \"&VLOOKUP(D11,ADMIN!$C$2:$E$10,3,FALSE))","v":""},{"$f":"IF(ISBLANK(A11),\"\",VLOOKUP(C11,ADMIN!$A$2:$B$22,2,FALSE))","v":""},{"$f":"IF(ISBLANK(A11),\"\",VLOOKUP(D11,ADMIN!$C$2:$D$10,2,FALSE))","v":""}]
[null,null,null,null,null,null,"",{"$f":"IF(ISBLANK(A12),\"\",B12&\"_\"&I12&\" \"&VLOOKUP(D12,ADMIN!$C$2:$E$10,3,FALSE))","v":""},{"$f":"IF(ISBLANK(A12),\"\",VLOOKUP(C12,ADMIN!$A$2:$B$22,2,FALSE))","v":""},{"$f":"IF(ISBLANK(A12),\"\",VLOOKUP(D12,ADMIN!$C$2:$D$10,2,FALSE))","v":""}]
[null,null,null,null,null,null,"",{"$f":"IF(ISBLANK(A13),\"\",B13&\"_\"&I13&\" \"&VLOOKUP(D13,ADMIN!$C$2:$E$10,3,FALSE))","v":""},{"$f":"IF(ISBLANK(A13),\"\",VLOOKUP(C13,ADMIN!$A$2:$B$22,2,FALSE))","v":""},{"$f":"IF(ISBLANK(A13),\"\",VLOOKUP(D13,ADMIN!$C$2:$D$10,2,FALSE))","v":""}]
[null,null,null,null,null,null,"",{"$f":"IF(ISBLANK(A14),\"\",B14&\"_\"&I14&\" \"&VLOOKUP(D14,ADMIN!$C$2:$E$10,3,FALSE))","v":""},{"$f":"IF(ISBLANK(A14),\"\",VLOOKUP(C14,ADMIN!$A$2:$B$22,2,FALSE))","v":""},{"$f":"IF(ISBLANK(A14),\"\",VLOOKUP(D14,ADMIN!$C$2:$D$10,2,FALSE))","v":""}]
[null,null,null,null,null,null,"",{"$f":"IF(ISBLANK(A15),\"\",B15&\"_\"&I15&\" \"&VLOOKUP(D15,ADMIN!$C$2:$E$10,3,FALSE))","v":""},{"$f":"IF(ISBLANK(A15),\"\",VLOOKUP(C15,ADMIN!$A$2:$B$22,2,FALSE))","v":""},{"$f":"IF(ISBLANK(A15),\"\",VLOOKUP(D15,ADMIN!$C$2:$D$10,2,FALSE))","v":""}]
[null,null,null,null,null,null,"",{"$f":"IF(ISBLANK(A16),\"\",B16&\"_\"&I16&\" \"&VLOOKUP(D16,ADMIN!$C$2:$E$10,3,FALSE))","v":""},{"$f":"IF(ISBLANK(A16),\"\",VLOOKUP(C16,ADMIN!$A$2:$B$22,2,FALSE))","v":""},{"$f":"IF(ISBLANK(A16),\"\",VLOOKUP(D16,ADMIN!$C$2:$D$10,2,FALSE))","v":""}]
[null,null,null,null,null,null,"",{"$f":"IF(ISBLANK(A17),\"\",B17&\"_\"&I17&\" \"&VLOOKUP(D17,ADMIN!$C$2:$E$10,3,FALSE))","v":""},{"$f":"IF(ISBLANK(A17),\"\",VLOOKUP(C17,ADMIN!$A$2:$B$22,2,FALSE))","v":""},{"$f":"IF(ISBLANK(A17),\"\",VLOOKUP(D17,ADMIN!$C$2:$D$10,2,FALSE))","v":""}]
[null,null,null,null,null,null,"",{"$f":"IF(ISBLANK(A18),\"\",B18&\"_\"&I18&\" \"&VLOOKUP(D18,ADMIN!$C$2:$E$10,3,FALSE))","v":""},{"$f":"IF(ISBLANK(A18),\"\",VLOOKUP(C18,ADMIN!$A$2:$B$22,2,FALSE))","v":""},{"$f":"IF(ISBLANK(A18),\"\",VLOOKUP(D18,ADMIN!$C$2:$D$10,2,FALSE))","v":""}]
[null,null,null,null,null,null,"",{"$f":"IF(ISBLANK(A19),\"\",B19&\"_\"&I19&\" \"&VLOOKUP(D19,ADMIN!$C$2:$E$10,3,FALSE))","v":""},{"$f":"IF(ISBLANK(A19),\"\",VLOOKUP(C19,ADMIN!$A$2:$B$22,2,FALSE))","v":""},{"$f":"IF(ISBLANK(A19),\"\",VLOOKUP(D19,ADMIN!$C$2:$D$10,2,FALSE))","v":""}]
[null,null,null,null,null,null,"",{"$f":"IF(ISBLANK(A20),\"\",B20&\"_\"&I20&\" \"&VLOOKUP(D20,ADMIN!$C$2:$E$10,3,FALSE))","v":""},{"$f":"IF(ISBLANK(A20),\"\",VLOOKUP(C20,ADMIN!$A$2:$B$22,2,FALSE))","v":""},{"$f":"IF(ISBLANK(A20),\"\",VLOOKUP(D20,ADMIN!$C$2:$D$10,2,FALSE))","v":""}]
[null,null,null,null,null,null,"",{"$f":"IF(ISBLANK(A21),\"\",B21&\"_\"&I21&\" \"&VLOOKUP(D21,ADMIN!$C$2:$E$10,3,FALSE))","v":""},{"$f":"IF(ISBLANK(A21),\"\",VLOOKUP(C21,ADMIN!$A$2:$B$22,2,FALSE))","v":""},{"$f":"IF(ISBLANK(A21),\"\",VLOOKUP(D21,ADMIN!$C$2:$D$10,2,FALSE))","v":""}]
[null,null,null,null,null,null,"",{"$f":"IF(ISBLANK(A22),\"\",B22&\"_\"&I22&\" \"&VLOOKUP(D22,ADMIN!$C$2:$E$10,3,FALSE))","v":""},{"$f":"IF(ISBLANK(A22),\"\",VLOOKUP(C22,ADMIN!$A$2:$B$22,2,FALSE))","v":""},{"$f":"IF(ISBLANK(A22),\"\",VLOOKUP(D22,ADMIN!$C$2:$D$10,2,FALSE))","v":""}]
[null,null,null,null,null,null,"",{"$f":"IF(ISBLANK(A23),\"\",B23&\"_\"&I23&\" \"&VLOOKUP(D23,ADMIN!$C$2:$E$10,3,FALSE))","v":""},{"$f":"IF(ISBLANK(A23),\"\",VLOOKUP(C23,ADMIN!$A$2:$B$22,2,FALSE))","v":""},{"$f":"IF(ISBLANK(A23),\"\",VLOOKUP(D23,ADMIN!$C$2:$D$10,2,FALSE))","v":""}]
[null,null,null,null,null,null,"",{"$f":"IF(ISBLANK(A24),\"\",B24&\"_\"&I24&\" \"&VLOOKUP(D24,ADMIN!$C$2:$E$10,3,FALSE))","v":""},{"$f":"IF(ISBLANK(A24),\"\",VLOOKUP(C24,ADMIN!$A$2:$B$22,2,FALSE))","v":""},{"$f":"IF(ISBLANK(A24),\"\",VLOOKUP(D24,ADMIN!$C$2:$D$10,2,FALSE))","v":""}]
[null,null,null,null,null,null,"",{"$f":"IF(ISBLANK(A25),\"\",B25&\"_\"&I25&\" \"&VLOOKUP(D25,ADMIN!$C$2:$E$10,3,FALSE))","v":""},{"$f":"IF(ISBLANK(A25),\"\",VLOOKUP(C25,ADMIN!$A$2:$B$22,2,FALSE))","v":""},{"$f":"IF(ISBLANK(A25),\"\",VLOOKUP(D25,ADMIN!$C$2:$D$10,2,FALSE))","v":""}]
[null,null,null,null,null,null,"",{"$f":"IF(ISBLANK(A26),\"\",B26&\"_\"&I26&\" \"&VLOOKUP(D26,ADMIN!$C$2:$E$10,3,FALSE))","v":""},{"$f":"IF(ISBLANK(A26),\"\",VLOOKUP(C26,ADMIN!$A$2:$B$22,2,FALSE))","v":""},{"$f":"IF(ISBLANK(A26),\"\",VLOOKUP(D26,ADMIN!$C$2:$D$10,2,FALSE))","v":""}]
[null,null,null,null,null,null,"",{"$f":"IF(ISBLANK(A27),\"\",B27&\"_\"&I27&\" \"&VLOOKUP(D27,ADMIN!$C$2:$E$10,3,FALSE))","v":""},{"$f":"IF(ISBLANK(A27),\"\",VLOOKUP(C27,ADMIN!$A$2:$B$22,2,FALSE))","v":""},{"$f":"IF(ISBLANK(A27),\"\",VLOOKUP(D27,ADMIN!$C$2:$D$10,2,FALSE))","v":""}]
[null,null,null,null,null,null,"",{"$f":"IF(ISBLANK(A28),\"\",B28&\"_\"&I28&\" \"&VLOOKUP(D28,ADMIN!$C$2:$E$10,3,FALSE))","v":""},{"$f":"IF(ISBLANK(A28),\"\",VLOOKUP(C28,ADMIN!$A$2:$B$22,2,FALSE))","v":""},{"$f":"IF(ISBLANK(A28),\"\",VLOOKUP(D28,ADMIN!$C$2:$D$10,2,FALSE))","v":""}]
[null,null,null,null,null,null,"",{"$f":"IF(ISBLANK(A29),\"\",B29&\"_\"&I29&\" \"&VLOOKUP(D29,ADMIN!$C$2:$E$10,3,FALSE))","v":""},{"$f":"IF(ISBLANK(A29),\"\",VLOOKUP(C29,ADMIN!$A$2:$B$22,2,FALSE))","v":""},{"$f":"IF(ISBLANK(A29),\"\",VLOOKUP(D29,ADMIN!$C$2:$D$10,2,FALSE))","v":""}]
[null,null,null,null,null,null,"",{"$f":"IF(ISBLANK(A30),\"\",B30&\"_\"&I30&\" \"&VLOOKUP(D30,ADMIN!$C$2:$E$10,3,FALSE))","v":""},{"$f":"IF(ISBLANK(A30),\"\",VLOOKUP(C30,ADMIN!$A$2:$B$22,2,FALSE))","v":""},{"$f":"IF(ISBLANK(A30),\"\",VLOOKUP(D30,ADMIN!$C$2:$D$10,2,FALSE))","v":""}]
[null,null,null,null,null,null,"",{"$f":"IF(ISBLANK(A31),\"\",B31&\"_\"&I31&\" \"&VLOOKUP(D31,ADMIN!$C$2:$E$10,3,FALSE))","v":""},{"$f":"IF(ISBLANK(A31),\"\",VLOOKUP(C31,ADMIN!$A$2:$B$22,2,FALSE))","v":""},{"$f":"IF(ISBLANK(A31),\"\",VLOOKUP(D31,ADMIN!$C$2:$D$10,2,FALSE))","v":""}]
[null,null,null,null,null,null,"",{"$f":"IF(ISBLANK(A32),\"\",B32&\"_\"&I32&\" \"&VLOOKUP(D32,ADMIN!$C$2:$E$10,3,FALSE))","v":""},{"$f":"IF(ISBLANK(A32),\"\",VLOOKUP(C32,ADMIN!$A$2:$B$22,2,FALSE))","v":""},{"$f":"IF(ISBLANK(A32),\"\",VLOOKUP(D32,ADMIN!$C$2:$D$10,2,FALSE))","v":""}]
[null,null,null,null,null,null,"",{"$f":"IF(ISBLANK(A33),\"\",B33&\"_\"&I33&\" \"&VLOOKUP(D33,ADMIN!$C$2:$E$10,3,FALSE))","v":""},{"$f":"IF(ISBLANK(A33),\"\",VLOOKUP(C33,ADMIN!$A$2:$B$22,2,FALSE))","v":""},{"$f":"IF(ISBLANK(A33),\"\",VLOOKUP(D33,ADMIN!$C$2:$D$10,2,FALSE))","v":""}]
[null,null,null,null,null,null,"",{"$f":"IF(ISBLANK(A34),\"\",B34&\"_\"&I34&\" \"&VLOOKUP(D34,ADMIN!$C$2:$E$10,3,FALSE))","v":""},{"$f":"IF(ISBLANK(A34),\"\",VLOOKUP(C34,ADMIN!$A$2:$B$22,2,FALSE))","v":""},{"$f":"IF(ISBLANK(A34),\"\",VLOOKUP(D34,ADMIN!$C$2:$D$10,2,FALSE))","v":""}]
[null,null,null,null,null,null,"",{"$f":"IF(ISBLANK(A35),\"\",B35&\"_\"&I35&\" \"&VLOOKUP(D35,ADMIN!$C$2:$E$10,3,FALSE))","v":""},{"$f":"IF(ISBLANK(A35),\"\",VLOOKUP(C35,ADMIN!$A$2:$B$22,2,FALSE))","v":""},{"$f":"IF(ISBLANK(A35),\"\",VLOOKUP(D35,ADMIN!$C$2:$D$10,2,FALSE))","v":""}]
[null,null,null,null,null,null,"",{"$f":"IF(ISBLANK(A36),\"\",B36&\"_\"&I36&\" \"&VLOOKUP(D36,ADMIN!$C$2:$E$10,3,FALSE))","v":""},{"$f":"IF(ISBLANK(A36),\"\",VLOOKUP(C36,ADMIN!$A$2:$B$22,2,FALSE))","v":""},{"$f":"IF(ISBLANK(A36),\"\",VLOOKUP(D36,ADMIN!$C$2:$D$10,2,FALSE))","v":""}]
[null,null,null,null,null,null,"",{"$f":"IF(ISBLANK(A37),\"\",B37&\"_\"&I37&\" \"&VLOOKUP(D37,ADMIN!$C$2:$E$10,3,FALSE))","v":""},{"$f":"IF(ISBLANK(A37),\"\",VLOOKUP(C37,ADMIN!$A$2:$B$22,2,FALSE))","v":""},{"$f":"IF(ISBLANK(A37),\"\",VLOOKUP(D37,ADMIN!$C$2:$D$10,2,FALSE))","v":""}]
[null,null,null,null,null,null,"",{"$f":"IF(ISBLANK(A38),\"\",B38&\"_\"&I38&\" \"&VLOOKUP(D38,ADMIN!$C$2:$E$10,3,FALSE))","v":""},{"$f":"IF(ISBLANK(A38),\"\",VLOOKUP(C38,ADMIN!$A$2:$B$22,2,FALSE))","v":""},{"$f":"IF(ISBLANK(A38),\"\",VLOOKUP(D38,ADMIN!$C$2:$D$10,2,FALSE))","v":""}]
[null,null,null,null,null,null,"",{"$f":"IF(ISBLANK(A39),\"\",B39&\"_\"&I39&\" \"&VLOOKUP(D39,ADMIN!$C$2:$E$10,3,FALSE))","v":""},{"$f":"IF(ISBLANK(A39),\"\",VLOOKUP(C39,ADMIN!$A$2:$B$22,2,FALSE))","v":""},{"$f":"IF(ISBLANK(A39),\"\",VLOOKUP(D39,ADMIN!$C$2:$D$10,2,FALSE))","v":""}]
[null,null,null,null,null,null,"",{"$f":"IF(ISBLANK(A40),\"\",B40&\"_\"&I40&\" \"&VLOOKUP(D40,ADMIN!$C$2:$E$10,3,FALSE))","v":""},{"$f":"IF(ISBLANK(A40),\"\",VLOOKUP(C40,ADMIN!$A$2:$B$22,2,FALSE))","v":""},{"$f":"IF(ISBLANK(A40),\"\",VLOOKUP(D40,ADMIN!$C$2:$D$10,2,FALSE))","v":""}]
[null,null,null,null,null,null,"",{"$f":"IF(ISBLANK(A41),\"\",B41&\"_\"&I41&\" \"&VLOOKUP(D41,ADMIN!$C$2:$E$10,3,FALSE))","v":""},{"$f":"IF(ISBLANK(A41),\"\",VLOOKUP(C41,ADMIN!$A$2:$B$22,2,FALSE))","v":""},{"$f":"IF(ISBLANK(A41),\"\",VLOOKUP(D41,ADMIN!$C$2:$D$10,2,FALSE))","v":""}]
[null,null,null,null,null,null,"",{"$f":"IF(ISBLANK(A42),\"\",B42&\"_\"&I42&\" \"&VLOOKUP(D42,ADMIN!$C$2:$E$10,3,FALSE))","v":""},{"$f":"IF(ISBLANK(A42),\"\",VLOOKUP(C42,ADMIN!$A$2:$B$22,2,FALSE))","v":""},{"$f":"IF(ISBLANK(A42),\"\",VLOOKUP(D42,ADMIN!$C$2:$D$10,2,FALSE))","v":""}]
[null,null,null,null,null,null,"",{"$f":"IF(ISBLANK(A43),\"\",B43&\"_\"&I43&\" \"&VLOOKUP(D43,ADMIN!$C$2:$E$10,3,FALSE))","v":""},{"$f":"IF(ISBLANK(A43),\"\",VLOOKUP(C43,ADMIN!$A$2:$B$22,2,FALSE))","v":""},{"$f":"IF(ISBLANK(A43),\"\",VLOOKUP(D43,ADMIN!$C$2:$D$10,2,FALSE))","v":""}]
[null,null,null,null,null,null,"",{"$f":"IF(ISBLANK(A44),\"\",B44&\"_\"&I44&\" \"&VLOOKUP(D44,ADMIN!$C$2:$E$10,3,FALSE))","v":""},{"$f":"IF(ISBLANK(A44),\"\",VLOOKUP(C44,ADMIN!$A$2:$B$22,2,FALSE))","v":""},{"$f":"IF(ISBLANK(A44),\"\",VLOOKUP(D44,ADMIN!$C$2:$D$10,2,FALSE))","v":""}]
[null,null,null,null,null,null,"",{"$f":"IF(ISBLANK(A45),\"\",B45&\"_\"&I45&\" \"&VLOOKUP(D45,ADMIN!$C$2:$E$10,3,FALSE))","v":""},{"$f":"IF(ISBLANK(A45),\"\",VLOOKUP(C45,ADMIN!$A$2:$B$22,2,FALSE))","v":""},{"$f":"IF(ISBLANK(A45),\"\",VLOOKUP(D45,ADMIN!$C$2:$D$10,2,FALSE))","v":""}]
[null,null,null,null,null,null,"",{"$f":"IF(ISBLANK(A46),\"\",B46&\"_\"&I46&\" \"&VLOOKUP(D46,ADMIN!$C$2:$E$10,3,FALSE))","v":""},{"$f":"IF(ISBLANK(A46),\"\",VLOOKUP(C46,ADMIN!$A$2:$B$22,2,FALSE))","v":""},{"$f":"IF(ISBLANK(A46),\"\",VLOOKUP(D46,ADMIN!$C$2:$D$10,2,FALSE))","v":""}]
[null,null,null,null,null,null,"",{"$f":"IF(ISBLANK(A47),\"\",B47&\"_\"&I47&\" \"&VLOOKUP(D47,ADMIN!$C$2:$E$10,3,FALSE))","v":""},{"$f":"IF(ISBLANK(A47),\"\",VLOOKUP(C47,ADMIN!$A$2:$B$22,2,FALSE))","v":""},{"$f":"IF(ISBLANK(A47),\"\",VLOOKUP(D47,ADMIN!$C$2:$D$10,2,FALSE))","v":""}]
[null,null,null,null,null,null,"",{"$f":"IF(ISBLANK(A48),\"\",B48&\"_\"&I48&\" \"&VLOOKUP(D48,ADMIN!$C$2:$E$10,3,FALSE))","v":""},{"$f":"IF(ISBLANK(A48),\"\",VLOOKUP(C48,ADMIN!$A$2:$B$22,2,FALSE))","v":""},{"$f":"IF(ISBLANK(A48),\"\",VLOOKUP(D48,ADMIN!$C$2:$D$10,2,FALSE))","v":""}]
[null,null,null,null,null,null,"",{"$f":"IF(ISBLANK(A49),\"\",B49&\"_\"&I49&\" \"&VLOOKUP(D49,ADMIN!$C$2:$E$10,3,FALSE))","v":""},{"$f":"IF(ISBLANK(A49),\"\",VLOOKUP(C49,ADMIN!$A$2:$B$22,2,FALSE))","v":""},{"$f":"IF(ISBLANK(A49),\"\",VLOOKUP(D49,ADMIN!$C$2:$D$10,2,FALSE))","v":""}]
[null,null,null,null,null,null,"",{"$f":"IF(ISBLANK(A50),\"\",B50&\"_\"&I50&\" \"&VLOOKUP(D50,ADMIN!$C$2:$E$10,3,FALSE))","v":""},{"$f":"IF(ISBLANK(A50),\"\",VLOOKUP(C50,ADMIN!$A$2:$B$22,2,FALSE))","v":""},{"$f":"IF(ISBLANK(A50),\"\",VLOOKUP(D50,ADMIN!$C$2:$D$10,2,FALSE))","v":""}]
[null,null,null,null,null,null,"",{"$f":"IF(ISBLANK(A51),\"\",B51&\"_\"&I51&\" \"&VLOOKUP(D51,ADMIN!$C$2:$E$10,3,FALSE))","v":""},{"$f":"IF(ISBLANK(A51),\"\",VLOOKUP(C51,ADMIN!$A$2:$B$22,2,FALSE))","v":""},{"$f":"IF(ISBLANK(A51),\"\",VLOOKUP(D51,ADMIN!$C$2:$D$10,2,FALSE))","v":""}]
[null,null,null,null,null,null,"",{"$f":"IF(ISBLANK(A52),\"\",B52&\"_\"&I52&\" \"&VLOOKUP(D52,ADMIN!$C$2:$E$10,3,FALSE))","v":""},{"$f":"IF(ISBLANK(A52),\"\",VLOOKUP(C52,ADMIN!$A$2:$B$22,2,FALSE))","v":""},{"$f":"IF(ISBLANK(A52),\"\",VLOOKUP(D52,ADMIN!$C$2:$D$10,2,FALSE))","v":""}]
[null,null,null,null,null,null,"",{"$f":"IF(ISBLANK(A53),\"\",B53&\"_\"&I53&\" \"&VLOOKUP(D53,ADMIN!$C$2:$E$10,3,FALSE))","v":""},{"$f":"IF(ISBLANK(A53),\"\",VLOOKUP(C53,ADMIN!$A$2:$B$22,2,FALSE))","v":""},{"$f":"IF(ISBLANK(A53),\"\",VLOOKUP(D53,ADMIN!$C$2:$D$10,2,FALSE))","v":""}]
[null,null,null,null,null,null,"",{"$f":"IF(ISBLANK(A54),\"\",B54&\"_\"&I54&\" \"&VLOOKUP(D54,ADMIN!$C$2:$E$10,3,FALSE))","v":""},{"$f":"IF(ISBLANK(A54),\"\",VLOOKUP(C54,ADMIN!$A$2:$B$22,2,FALSE))","v":""},{"$f":"IF(ISBLANK(A54),\"\",VLOOKUP(D54,ADMIN!$C$2:$D$10,2,FALSE))","v":""}]
[null,null,null,null,null,null,"",{"$f":"IF(ISBLANK(A55),\"\",B55&\"_\"&I55&\" \"&VLOOKUP(D55,ADMIN!$C$2:$E$10,3,FALSE))","v":""},{"$f":"IF(ISBLANK(A55),\"\",VLOOKUP(C55,ADMIN!$A$2:$B$22,2,FALSE))","v":""},{"$f":"IF(ISBLANK(A55),\"\",VLOOKUP(D55,ADMIN!$C$2:$D$10,2,FALSE))","v":""}]
[null,null,null,null,null,null,"",{"$f":"IF(ISBLANK(A56),\"\",B56&\"_\"&I56&\" \"&VLOOKUP(D56,ADMIN!$C$2:$E$10,3,FALSE))","v":""},{"$f":"IF(ISBLANK(A56),\"\",VLOOKUP(C56,ADMIN!$A$2:$B$22,2,FALSE))","v":""},{"$f":"IF(ISBLANK(A56),\"\",VLOOKUP(D56,ADMIN!$C$2:$D$10,2,FALSE))","v":""}]
[null,null,null,null,null,null,"",{"$f":"IF(ISBLANK(A57),\"\",B57&\"_\"&I57&\" \"&VLOOKUP(D57,ADMIN!$C$2:$E$10,3,FALSE))","v":""},{"$f":"IF(ISBLANK(A57),\"\",VLOOKUP(C57,ADMIN!$A$2:$B$22,2,FALSE))","v":""},{"$f":"IF(ISBLANK(A57),\"\",VLOOKUP(D57,ADMIN!$C$2:$D$10,2,FALSE))","v":""}]
[null,null,null,null,null,null,"",{"$f":"IF(ISBLANK(A58),\"\",B58&\"_\"&I58&\" \"&VLOOKUP(D58,ADMIN!$C$2:$E$10,3,FALSE))","v":""},{"$f":"IF(ISBLANK(A58),\"\",VLOOKUP(C58,ADMIN!$A$2:$B$22,2,FALSE))","v":""},{"$f":"IF(ISBLANK(A58),\"\",VLOOKUP(D58,ADMIN!$C$2:$D$10,2,FALSE))","v":""}]
[null,null,null,null,null,null,"",{"$f":"IF(ISBLANK(A59),\"\",B59&\"_\"&I59&\" \"&VLOOKUP(D59,ADMIN!$C$2:$E$10,3,FALSE))","v":""},{"$f":"IF(ISBLANK(A59),\"\",VLOOKUP(C59,ADMIN!$A$2:$B$22,2,FALSE))","v":""},{"$f":"IF(ISBLANK(A59),\"\",VLOOKUP(D59,ADMIN!$C$2:$D$10,2,FALSE))","v":""}]
[null,null,null,null,null,null,"",{"$f":"IF(ISBLANK(A60),\"\",B60&\"_\"&I60&\" \"&VLOOKUP(D60,ADMIN!$C$2:$E$10,3,FALSE))","v":""},{"$f":"IF(ISBLANK(A60),\"\",VLOOKUP(C60,ADMIN!$A$2:$B$22,2,FALSE))","v":""},{"$f":"IF(ISBLANK(A60),\"\",VLOOKUP(D60,ADMIN!$C$2:$D$10,2,FALSE))","v":""}]
[null,null,null,null,null,null,"",{"$f":"IF(ISBLANK(A61),\"\",B61&\"_\"&I61&\" \"&VLOOKUP(D61,ADMIN!$C$2:$E$10,3,FALSE))","v":""},{"$f":"IF(ISBLANK(A61),\"\",VLOOKUP(C61,ADMIN!$A$2:$B$22,2,FALSE))","v":""},{"$f":"IF(ISBLANK(A61),\"\",VLOOKUP(D61,ADMIN!$C$2:$D$10,2,FALSE))","v":""}]
[null,null,null,null,null,null,"",{"$f":"IF(ISBLANK(A62),\"\",B62&\"_\"&I62&\" \"&VLOOKUP(D62,ADMIN!$C$2:$E$10,3,FALSE))","v":""},{"$f":"IF(ISBLANK(A62),\"\",VLOOKUP(C62,ADMIN!$A$2:$B$22,2,FALSE))","v":""},{"$f":"IF(ISBLANK(A62),\"\",VLOOKUP(D62,ADMIN!$C$2:$D$10,2,FALSE))","v":""}]
[null,null,null,null,null,null,"",{"$f":"IF(ISBLANK(A63),\"\",B63&\"_\"&I63&\" \"&VLOOKUP(D63,ADMIN!$C$2:$E$10,3,FALSE))","v":""},{"$f":"IF(ISBLANK(A63),\"\",VLOOKUP(C63,ADMIN!$A$2:$B$22,2,FALSE))","v":""},{"$f":"IF(ISBLANK(A63),\"\",VLOOKUP(D63,ADMIN!$C$2:$D$10,2,FALSE))","v":""}]
[null,null,null,null,null,null,"",{"$f":"IF(ISBLANK(A64),\"\",B64&\"_\"&I64&\" \"&VLOOKUP(D64,ADMIN!$C$2:$E$10,3,FALSE))","v":""},{"$f":"IF(ISBLANK(A64),\"\",VLOOKUP(C64,ADMIN!$A$2:$B$22,2,FALSE))","v":""},{"$f":"IF(ISBLANK(A64),\"\",VLOOKUP(D64,ADMIN!$C$2:$D$10,2,FALSE))","v":""}]
[null,null,null,null,null,null,"",{"$f":"IF(ISBLANK(A65),\"\",B65&\"_\"&I65&\" \"&VLOOKUP(D65,ADMIN!$C$2:$E$10,3,FALSE))","v":""},{"$f":"IF(ISBLANK(A65),\"\",VLOOKUP(C65,ADMIN!$A$2:$B$22,2,FALSE))","v":""},{"$f":"IF(ISBLANK(A65),\"\",VLOOKUP(D65,ADMIN!$C$2:$D$10,2,FALSE))","v":""}]
[null,null,null,null,null,null,"",{"$f":"IF(ISBLANK(A66),\"\",B66&\"_\"&I66&\" \"&VLOOKUP(D66,ADMIN!$C$2:$E$10,3,FALSE))","v":""},{"$f":"IF(ISBLANK(A66),\"\",VLOOKUP(C66,ADMIN!$A$2:$B$22,2,FALSE))","v":""},{"$f":"IF(ISBLANK(A66),\"\",VLOOKUP(D66,ADMIN!$C$2:$D$10,2,FALSE))","v":""}]
[null,null,null,null,null,null,{"$f":"IF(ISBLANK(A67),\"\",B67&\"_\"&I67&\"_\"&J67)","v":""},{"$f":"IF(ISBLANK(A67),\"\",B67&\"_\"&I67&\" \"&VLOOKUP(D67,ADMIN!$C$2:$E$10,3,FALSE))","v":""},{"$f":"IF(ISBLANK(A67),\"\",VLOOKUP(C67,ADMIN!$A$2:$B$22,2,FALSE))","v":""},{"$f":"IF(ISBLANK(A67),\"\",VLOOKUP(D67,ADMIN!$C$2:$D$10,2,FALSE))","v":""}]
[null,null,null,null,null,null,"",{"$f":"IF(ISBLANK(A68),\"\",B68&\"_\"&I68&\" \"&VLOOKUP(D68,ADMIN!$C$2:$E$10,3,FALSE))","v":""},{"$f":"IF(ISBLANK(A68),\"\",VLOOKUP(C68,ADMIN!$A$2:$B$22,2,FALSE))","v":""},{"$f":"IF(ISBLANK(A68),\"\",VLOOKUP(D68,ADMIN!$C$2:$D$10,2,FALSE))","v":""}]
[null,null,null,null,null,null,"",{"$f":"IF(ISBLANK(A69),\"\",B69&\"_\"&I69&\" \"&VLOOKUP(D69,ADMIN!$C$2:$E$10,3,FALSE))","v":""},{"$f":"IF(ISBLANK(A69),\"\",VLOOKUP(C69,ADMIN!$A$2:$B$22,2,FALSE))","v":""},{"$f":"IF(ISBLANK(A69),\"\",VLOOKUP(D69,ADMIN!$C$2:$D$10,2,FALSE))","v":""}]
[null,null,null,null,null,null,"",{"$f":"IF(ISBLANK(A70),\"\",B70&\"_\"&I70&\" \"&VLOOKUP(D70,ADMIN!$C$2:$E$10,3,FALSE))","v":""},{"$f":"IF(ISBLANK(A70),\"\",VLOOKUP(C70,ADMIN!$A$2:$B$22,2,FALSE))","v":""},{"$f":"IF(ISBLANK(A70),\"\",VLOOKUP(D70,ADMIN!$C$2:$D$10,2,FALSE))","v":""}]
[null,null,null,null,null,null,"",{"$f":"IF(ISBLANK(A71),\"\",B71&\"_\"&I71&\" \"&VLOOKUP(D71,ADMIN!$C$2:$E$10,3,FALSE))","v":""},{"$f":"IF(ISBLANK(A71),\"\",VLOOKUP(C71,ADMIN!$A$2:$B$22,2,FALSE))","v":""},{"$f":"IF(ISBLANK(A71),\"\",VLOOKUP(D71,ADMIN!$C$2:$D$10,2,FALSE))","v":""}]
[null,null,null,null,null,null,"",{"$f":"IF(ISBLANK(A72),\"\",B72&\"_\"&I72&\" \"&VLOOKUP(D72,ADMIN!$C$2:$E$10,3,FALSE))","v":""},{"$f":"IF(ISBLANK(A72),\"\",VLOOKUP(C72,ADMIN!$A$2:$B$22,2,FALSE))","v":""},{"$f":"IF(ISBLANK(A72),\"\",VLOOKUP(D72,ADMIN!$C$2:$D$10,2,FALSE))","v":""}]
[null,null,null,null,null,null,"",{"$f":"IF(ISBLANK(A73),\"\",B73&\"_\"&I73&\" \"&VLOOKUP(D73,ADMIN!$C$2:$E$10,3,FALSE))","v":""},{"$f":"IF(ISBLANK(A73),\"\",VLOOKUP(C73,ADMIN!$A$2:$B$22,2,FALSE))","v":""},{"$f":"IF(ISBLANK(A73),\"\",VLOOKUP(D73,ADMIN!$C$2:$D$10,2,FALSE))","v":""}]
[null,null,null,null,null,null,"",{"$f":"IF(ISBLANK(A74),\"\",B74&\"_\"&I74&\" \"&VLOOKUP(D74,ADMIN!$C$2:$E$10,3,FALSE))","v":""},{"$f":"IF(ISBLANK(A74),\"\",VLOOKUP(C74,ADMIN!$A$2:$B$22,2,FALSE))","v":""},{"$f":"IF(ISBLANK(A74),\"\",VLOOKUP(D74,ADMIN!$C$2:$D$10,2,FALSE))","v":""}]
[null,null,null,null,null,null,"",{"$f":"IF(ISBLANK(A75),\"\",B75&\"_\"&I75&\" \"&VLOOKUP(D75,ADMIN!$C$2:$E$10,3,FALSE))","v":""},{"$f":"IF(ISBLANK(A75),\"\",VLOOKUP(C75,ADMIN!$A$2:$B$22,2,FALSE))","v":""},{"$f":"IF(ISBLANK(A75),\"\",VLOOKUP(D75,ADMIN!$C$2:$D$10,2,FALSE))","v":""}]
[null,null,null,null,null,null,"",{"$f":"IF(ISBLANK(A76),\"\",B76&\"_\"&I76&\" \"&VLOOKUP(D76,ADMIN!$C$2:$E$10,3,FALSE))","v":""},{"$f":"IF(ISBLANK(A76),\"\",VLOOKUP(C76,ADMIN!$A$2:$B$22,2,FALSE))","v":""},{"$f":"IF(ISBLANK(A76),\"\",VLOOKUP(D76,ADMIN!$C$2:$D$10,2,FALSE))","v":""}]
[null,null,null,null,null,null,"",{"$f":"IF(ISBLANK(A77),\"\",B77&\"_\"&I77&\" \"&VLOOKUP(D77,ADMIN!$C$2:$E$10,3,FALSE))","v":""},{"$f":"IF(ISBLANK(A77),\"\",VLOOKUP(C77,ADMIN!$A$2:$B$22,2,FALSE))","v":""},{"$f":"IF(ISBLANK(A77),\"\",VLOOKUP(D77,ADMIN!$C$2:$D$10,2,FALSE))","v":""}]
[null,null,null,null,null,null,"",{"$f":"IF(ISBLANK(A78),\"\",B78&\"_\"&I78&\" \"&VLOOKUP(D78,ADMIN!$C$2:$E$10,3,FALSE))","v":""},{"$f":"IF(ISBLANK(A78),\"\",VLOOKUP(C78,ADMIN!$A$2:$B$22,2,FALSE))","v":""},{"$f":"IF(ISBLANK(A78),\"\",VLOOKUP(D78,ADMIN!$C$2:$D$10,2,FALSE))","v":""}]
[null,null,null,null,null,null,"",{"$f":"IF(ISBLANK(A79),\"\",B79&\"_\"&I79&\" \"&VLOOKUP(D79,ADMIN!$C$2:$E$10,3,FALSE))","v":""},{"$f":"IF(ISBLANK(A79),\"\",VLOOKUP(C79,ADMIN!$A$2:$B$22,2,FALSE))","v":""},{"$f":"IF(ISBLANK(A79),\"\",VLOOKUP(D79,ADMIN!$C$2:$D$10,2,FALSE))","v":""}]
[null,null,null,null,null,null,"",{"$f":"IF(ISBLANK(A80),\"\",B80&\"_\"&I80&\" \"&VLOOKUP(D80,ADMIN!$C$2:$E$10,3,FALSE))","v":""},{"$f":"IF(ISBLANK(A80),\"\",VLOOKUP(C80,ADMIN!$A$2:$B$22,2,FALSE))","v":""},{"$f":"IF(ISBLANK(A80),\"\",VLOOKUP(D80,ADMIN!$C$2:$D$10,2,FALSE))","v":""}]
{"$rows_left_out":221}